�i��,�V���i��,JAN�R�[�h,�艿,�d��,��,����,���s��,�`��,�p�r,�E��,�ގ�,�����@,�����A,�����B,�����C,�����D,�����E,�����F,�����G,�����H,�����I,,�J���[
HM113-BR,KH HUMHEM ���� �z���_�[�E���z���_�[�t �u���E��,4948377682459,4500,300,230,220,120,�|�P�b�g�Q�i�^���E�z���_�[�t��,�H��S�ʎ��[,�΁E�S�؁E�h���E�y�؁E�����E�d�H���S��,���a��,��G��̂悢�_�炩���Ɩ��Ղɋ������x�������˔��������a�Ȃ��̗p,�R�b�g���n�J�W���A����ƕ��Ƀ}�b�`���邷��f�ފ��ő�l�C,���y�ʂ�����,���|�P�b�g���U�A�̃z���_�[�ōH��̐��������₷��,�B���˂������Ȃ����b�V������������,,�J�������L���ێ�����Ǝ��̕⋭��v�Z�p,�J�b�^�[�i�C�t���Œ�ł���T�C�h�|�P�b�g,�O�ʃ|�P�b�g�����̕⋭��v�ł���ɏ�v,,,�u���E��
HM113-K,KH HUMHEM ���� �z���_�[�E���z���_�[�t �u���b�N,4948377682442,4500,300,230,220,120,�|�P�b�g�Q�i�^���E�z���_�[�t��,�H��S�ʎ��[,�΁E�S�؁E�h���E�y�؁E�����E�d�H���S��,���a��,��G��̂悢�_�炩���Ɩ��Ղɋ������x�������˔��������a�Ȃ��̗p,�R�b�g���n�J�W���A����ƕ��Ƀ}�b�`���邷��f�ފ��ő�l�C,���y�ʂ�����,���|�P�b�g���U�A�̃z���_�[�ōH��̐��������₷��,�B���˂������Ȃ����b�V������������,,�J�������L���ێ�����Ǝ��̕⋭��v�Z�p,�J�b�^�[�i�C�t���Œ�ł���T�C�h�|�P�b�g,�O�ʃ|�P�b�g�����̕⋭��v�ł���ɏ�v,,,�u���b�N
HM113-N,KH HUMHEM ���� �z���_�[�E���z���_�[�t �l�C�r�[,4948377682435,4500,300,230,220,120,�|�P�b�g�Q�i�^���E�z���_�[�t��,�H��S�ʎ��[,�΁E�S�؁E�h���E�y�؁E�����E�d�H���S��,���a��,��G��̂悢�_�炩���Ɩ��Ղɋ������x�������˔��������a�Ȃ��̗p,�R�b�g���n�J�W���A����ƕ��Ƀ}�b�`���邷��f�ފ��ő�l�C,���y�ʂ�����,���|�P�b�g���U�A�̃z���_�[�ōH��̐��������₷��,�B���˂������Ȃ����b�V������������,,�J�������L���ێ�����Ǝ��̕⋭��v�Z�p,�J�b�^�[�i�C�t���Œ�ł���T�C�h�|�P�b�g,�O�ʃ|�P�b�g�����̕⋭��v�ł���ɏ�v,,,�l�C�r�[
HM1199-BR,KH HUMHEM ���� �u���E��,4948377682367,3270,300,200,250,100,�|�P�b�g�Q�i,�H��S�ʎ��[,�΁E�S�؁E�h���E�y�؁E�����E�d�H���S��,���a��,��G��̂悢�_�炩���Ɩ��Ղɋ������x�������˔��������a�Ȃ��̗p,�R�b�g���n�J�W���A����ƕ��Ƀ}�b�`���邷��f�ފ��ő�l�C,���y�ʂ�����,���g�����o���₷���ė����ɂ����΂߃J�b�g�̃|�P�b�g,�B���˂������Ȃ����b�V������������,,,,,,,�u���E��
HM1199-K,KH HUMHEM ���� �u���b�N,4948377682350,3270,300,200,250,100,�|�P�b�g�Q�i,�H��S�ʎ��[,�΁E�S�؁E�h���E�y�؁E�����E�d�H���S��,���a��,��G��̂悢�_�炩���Ɩ��Ղɋ������x�������˔��������a�Ȃ��̗p,�R�b�g���n�J�W���A����ƕ��Ƀ}�b�`���邷��f�ފ��ő�l�C,���y�ʂ�����,���g�����o���₷���ė����ɂ����΂߃J�b�g�̃|�P�b�g,�B���˂������Ȃ����b�V������������,,,,,,,�u���b�N
HM1199-N,KH HUMHEM ���� �l�C�r�[,4948377682343,3270,300,200,250,100,�|�P�b�g�Q�i,�H��S�ʎ��[,�΁E�S�؁E�h���E�y�؁E�����E�d�H���S��,���a��,��G��̂悢�_�炩���Ɩ��Ղɋ������x�������˔��������a�Ȃ��̗p,�R�b�g���n�J�W���A����ƕ��Ƀ}�b�`���邷��f�ފ��ő�l�C,���y�ʂ�����,���g�����o���₷���ė����ɂ����΂߃J�b�g�̃|�P�b�g,�B���˂������Ȃ����b�V������������,,,,,,,�l�C�r�[
HM1199MBR,KH HUMHEM ���� �ی^ �u���E��,4948377682428,2660,130,118,175,118,�����P�[�X�^�J���r�i�t��,�H��S�ʎ��[,������E��Ή�,���a��,��G��̂悢�_�炩���Ɩ��Ղɋ������x�������˔��������a�Ȃ��̗p,�R�b�g���n�J�W���A����ƕ��Ƀ}�b�`���邷��f�ފ��ő�l�C,���y�ʂ�����,�݂艺���Ďg�p�ł���J���r�i�t��,���^�^�C�v�Ŏ��[���₷�����[���B���X�b�|������,��ʕ⋭�Ŕ����ɂ�����v,�J�����⋭�Ō^���ꂵ�ɂ���,,,,,�u���E��
HM1199M-K,KH HUMHEM ���� �ی^ �u���b�N,4948377682411,2660,130,118,175,118,�����P�[�X�^�J���r�i�t��,�H��S�ʎ��[,������E��Ή�,���a��,��G��̂悢�_�炩���Ɩ��Ղɋ������x�������˔��������a�Ȃ��̗p,�R�b�g���n�J�W���A����ƕ��Ƀ}�b�`���邷��f�ފ��ő�l�C,���y�ʂ�����,�݂艺���Ďg�p�ł���J���r�i�t��,���^�^�C�v�Ŏ��[���₷�����[���B���X�b�|������,��ʕ⋭�Ŕ����ɂ�����v,�J�����⋭�Ō^���ꂵ�ɂ���,,,,,�u���b�N
HM1199M-N,KH HUMHEM ���� �ی^ �l�C�r�[,4948377682404,2660,130,118,175,118,�����P�[�X�^�J���r�i�t��,�H��S�ʎ��[,������E��Ή�,���a��,��G��̂悢�_�炩���Ɩ��Ղɋ������x�������˔��������a�Ȃ��̗p,�R�b�g���n�J�W���A����ƕ��Ƀ}�b�`���邷��f�ފ��ő�l�C,���y�ʂ�����,�݂艺���Ďg�p�ł���J���r�i�t��,���^�^�C�v�Ŏ��[���₷�����[���B���X�b�|������,��ʕ⋭�Ŕ����ɂ�����v,�J�����⋭�Ō^���ꂵ�ɂ���,,,,,�l�C�r�[
HM1199PBR,KH HUMHEM ���� ���^ �u���E��,4948377682398,2660,115,145,200,80,�����P�[�X�^�J���r�i�t��,�H��S�ʎ��[,������E��Ή�,���a��,��G��̂悢�_�炩���Ɩ��Ղɋ������x�������˔��������a�Ȃ��̗p,�R�b�g���n�J�W���A����ƕ��Ƀ}�b�`���邷��f�ފ��ő�l�C,���y�ʂ�����,�݂艺���Ďg�p�ł���J���r�i�t��,�|�P�b�g�^�Ŏ��[������яo���ɂ���,,,,,,,�u���E��
HM1199P-K,KH HUMHEM ���� ���^ �u���b�N,4948377682381,2660,115,145,200,80,�����P�[�X�^�J���r�i�t��,�H��S�ʎ��[,������E��Ή�,���a��,��G��̂悢�_�炩���Ɩ��Ղɋ������x�������˔��������a�Ȃ��̗p,�R�b�g���n�J�W���A����ƕ��Ƀ}�b�`���邷��f�ފ��ő�l�C,���y�ʂ�����,�݂艺���Ďg�p�ł���J���r�i�t��,�|�P�b�g�^�Ŏ��[������яo���ɂ���,,,,,,,�u���b�N
HM1199P-N,KH HUMHEM ���� ���^ �l�C�r�[,4948377682374,2660,115,145,200,80,�����P�[�X�^�J���r�i�t��,�H��S�ʎ��[,������E��Ή�,���a��,��G��̂悢�_�炩���Ɩ��Ղɋ������x�������˔��������a�Ȃ��̗p,�R�b�g���n�J�W���A����ƕ��Ƀ}�b�`���邷��f�ފ��ő�l�C,���y�ʂ�����,�݂艺���Ďg�p�ł���J���r�i�t��,�|�P�b�g�^�Ŏ��[������яo���ɂ���,,,,,,,�l�C�r�[
HM127-BR,KH HUMHEM �B�� ���^ �u���E��,4948377682480,6000,460,280,360,110,�|�P�b�g�Q�i,�H��S�ʎ��[,�΁E�S�؁E�h���E�y�؁E�����E�d�H���S��,���a��,��G��̂悢�_�炩���Ɩ��Ղɋ������x�������˔��������a�Ȃ��̗p,�R�b�g���n�J�W���A����ƕ��Ƀ}�b�`���邷��f�ފ��ő�l�C,���y�ʂ�����,�[���t���J�b�g�x���g�ʂ��Ńn�[�l�X�̏ォ��������\,���^�^�C�v�ŋ�����ƂɍœK,,,,,,,�u���E��
HM127-K,KH HUMHEM �B�� ���^ �u���b�N,4948377682473,6000,460,280,360,110,�|�P�b�g�Q�i,�H��S�ʎ��[,�΁E�S�؁E�h���E�y�؁E�����E�d�H���S��,���a��,��G��̂悢�_�炩���Ɩ��Ղɋ������x�������˔��������a�Ȃ��̗p,�R�b�g���n�J�W���A����ƕ��Ƀ}�b�`���邷��f�ފ��ő�l�C,���y�ʂ�����,�[���t���J�b�g�x���g�ʂ��Ńn�[�l�X�̏ォ��������\,���^�^�C�v�ŋ�����ƂɍœK,,,,,,,�u���b�N
HM127-N,KH HUMHEM �B�� ���^ �l�C�r�[,4948377682466,6000,460,280,360,110,�|�P�b�g�Q�i,�H��S�ʎ��[,�΁E�S�؁E�h���E�y�؁E�����E�d�H���S��,���a��,��G��̂悢�_�炩���Ɩ��Ղɋ������x�������˔��������a�Ȃ��̗p,�R�b�g���n�J�W���A����ƕ��Ƀ}�b�`���邷��f�ފ��ő�l�C,���y�ʂ�����,�[���t���J�b�g�x���g�ʂ��Ńn�[�l�X�̏ォ��������\,���^�^�C�v�ŋ�����ƂɍœK,,,,,,,�l�C�r�[
HM2219-BR,KH HUMHEM ���� �p�^ �u���E��,4948377682510,4000,175,145,180,90,�����P�[�X,�H��S�ʎ��[,��H�E�d�H���S��,���a��,��G��̂悢�_�炩���Ɩ��Ղɋ������x�������˔��������a�Ȃ��̗p,�R�b�g���n�J�W���A����ƕ��Ƀ}�b�`���邷��f�ފ��ő�l�C,���y�ʂ�����,,,,,,,,,�u���E��
HM2219-K,KH HUMHEM ���� �p�^ �u���b�N,4948377682503,4000,175,145,180,90,�����P�[�X,�H��S�ʎ��[,��H�E�d�H���S��,���a��,��G��̂悢�_�炩���Ɩ��Ղɋ������x�������˔��������a�Ȃ��̗p,�R�b�g���n�J�W���A����ƕ��Ƀ}�b�`���邷��f�ފ��ő�l�C,���y�ʂ�����,,,,,,,,,�u���b�N
HM2219-N,KH HUMHEM ���� �p�^ �l�C�r�[,4948377682497,4000,175,145,180,90,�����P�[�X,�H��S�ʎ��[,��H�E�d�H���S��,���a��,��G��̂悢�_�炩���Ɩ��Ղɋ������x�������˔��������a�Ȃ��̗p,�R�b�g���n�J�W���A����ƕ��Ƀ}�b�`���邷��f�ފ��ő�l�C,���y�ʂ�����,,,,,,,,,�l�C�r�[
HM24206BR,KH HUMHEM �B�� �u���E��,4948377682541,6000,500,335,350,125,�|�P�b�g�Q�i�^���E�z���_�[�t��,�H��S�ʎ��[,�΁E�S�؁E�h���E�y�؁E�����E�d�H���S��,���a��,��G��̂悢�_�炩���Ɩ��Ղɋ������x�������˔��������a�Ȃ��̗p,�R�b�g���n�J�W���A����ƕ��Ƀ}�b�`���邷��f�ފ��ő�l�C,���y�ʂ�����,�[���t���J�b�g�x���g�ʂ��Ńn�[�l�X�̏ォ��������\,�B���˂������Ȃ����b�V������������,,,,,,,�u���E��
HM24206-K,KH HUMHEM �B�� �u���b�N,4948377682534,6000,500,335,350,125,�|�P�b�g�Q�i�^���E�z���_�[�t��,�H��S�ʎ��[,�΁E�S�؁E�h���E�y�؁E�����E�d�H���S��,���a��,��G��̂悢�_�炩���Ɩ��Ղɋ������x�������˔��������a�Ȃ��̗p,�R�b�g���n�J�W���A����ƕ��Ƀ}�b�`���邷��f�ފ��ő�l�C,���y�ʂ�����,�[���t���J�b�g�x���g�ʂ��Ńn�[�l�X�̏ォ��������\,�B���˂������Ȃ����b�V������������,,,,,,,�u���b�N
HM24206-N,KH HUMHEM �B�� �l�C�r�[,4948377682527,6000,500,335,350,125,�|�P�b�g�Q�i�^���E�z���_�[�t��,�H��S�ʎ��[,�΁E�S�؁E�h���E�y�؁E�����E�d�H���S��,���a��,��G��̂悢�_�炩���Ɩ��Ղɋ������x�������˔��������a�Ȃ��̗p,�R�b�g���n�J�W���A����ƕ��Ƀ}�b�`���邷��f�ފ��ő�l�C,���y�ʂ�����,�[���t���J�b�g�x���g�ʂ��Ńn�[�l�X�̏ォ��������\,�B���˂������Ȃ����b�V������������,,,,,,,�l�C�r�[
HM500-BR,KH HUMHEM �T�|�[�^�[�x���g �u���E��,4948377682572,5500,420,860,165,25,�ȉ~�^,�����ی�,������E��Ή�,���a��,��G��̂悢�_�炩���Ɩ��Ղɋ������x�������˔��������a�Ȃ��̗p,�R�b�g���n�J�W���A����ƕ��Ƀ}�b�`���邷��f�ފ��ő�l�C,���y�ʂ�����,���������������t�B�b�g���A�b�v,�T�_���ߋ�����Ńx���g�����ꂸ�ɃV�b�J���Œ�\,�S�Ẵx���g�ʂ������������E���ō��������R�ɃJ�X�^�}�C�Y,,,,,,�u���E��
HM500-K,KH HUMHEM �T�|�[�^�[�x���g �u���b�N,4948377682565,5500,420,860,165,25,�ȉ~�^,�����ی�,������E��Ή�,���a��,��G��̂悢�_�炩���Ɩ��Ղɋ������x�������˔��������a�Ȃ��̗p,�R�b�g���n�J�W���A����ƕ��Ƀ}�b�`���邷��f�ފ��ő�l�C,���y�ʂ�����,���������������t�B�b�g���A�b�v,�T�_���ߋ�����Ńx���g�����ꂸ�ɃV�b�J���Œ�\,�S�Ẵx���g�ʂ������������E���ō��������R�ɃJ�X�^�}�C�Y,,,,,,�u���b�N
HM500-N,KH HUMHEM �T�|�[�^�[�x���g �l�C�r�[,4948377682558,5500,420,860,165,25,�ȉ~�^,�����ی�,������E��Ή�,���a��,��G��̂悢�_�炩���Ɩ��Ղɋ������x�������˔��������a�Ȃ��̗p,�R�b�g���n�J�W���A����ƕ��Ƀ}�b�`���邷��f�ފ��ő�l�C,���y�ʂ�����,���������������t�B�b�g���A�b�v,�T�_���ߋ�����Ńx���g�����ꂸ�ɃV�b�J���Œ�\,�S�Ẵx���g�ʂ������������E���ō��������R�ɃJ�X�^�}�C�Y,,,,,,�l�C�r�[
HMBD01-BR,KH HUMHEM �{�f�B�[�o�b�O �� �u���E��,4948377683098,5200,305,140,310,70,�{�f�B�[�o�b�O,�����S�ʎ��[,�I�t���̎���������,���a��,��G��̂悢�_�炩���Ɩ��Ղɋ������x�������˔��������a�Ȃ��̗p,�R�b�g���n�J�W���A����ƕ��Ƀ}�b�`���邷��f�ފ��ő�l�C,���y�ʂ�����,�X�����`��̃{�f�B�[�o�b�O,���[�͂ɗD�ꂽ�ȉ~�\���ŃX�b�L���̂Ƀt�B�b�g,,,,,,,�u���E��
HMBD01-K,KH HUMHEM �{�f�B�[�o�b�O �� �u���b�N,4948377683074,5200,305,140,310,70,�{�f�B�[�o�b�O,�����S�ʎ��[,�I�t���̎���������,���a��,��G��̂悢�_�炩���Ɩ��Ղɋ������x�������˔��������a�Ȃ��̗p,�R�b�g���n�J�W���A����ƕ��Ƀ}�b�`���邷��f�ފ��ő�l�C,���y�ʂ�����,�X�����`��̃{�f�B�[�o�b�O,���[�͂ɗD�ꂽ�ȉ~�\���ŃX�b�L���̂Ƀt�B�b�g,,,,,,,�u���b�N
HMBD01-N,KH HUMHEM �{�f�B�[�o�b�O �� �l�C�r�[,4948377683081,5200,305,140,310,70,�{�f�B�[�o�b�O,�����S�ʎ��[,�I�t���̎���������,���a��,��G��̂悢�_�炩���Ɩ��Ղɋ������x�������˔��������a�Ȃ��̗p,�R�b�g���n�J�W���A����ƕ��Ƀ}�b�`���邷��f�ފ��ő�l�C,���y�ʂ�����,�X�����`��̃{�f�B�[�o�b�O,���[�͂ɗD�ꂽ�ȉ~�\���ŃX�b�L���̂Ƀt�B�b�g,,,,,,,�l�C�r�[
HMBD02-BR,KH HUMHEM �{�f�B�[�o�b�O �� �u���E��,4948377682602,5500,480,250,320,140,�{�f�B�[�o�b�O,�����S�ʎ��[,�I�t���̎���������,���a��,��G��̂悢�_�炩���Ɩ��Ղɋ������x�������˔��������a�Ȃ��̗p,�R�b�g���n�J�W���A����ƕ��Ƀ}�b�`���邷��f�ފ��ő�l�C,���y�ʂ�����,���[�͂ɗD�ꂽ�傫�߂̃{�f�B�[�o�b�O,�|�P�b�g�����ŏ������[�ɕ֗�,,,,,,,�u���E��
HMBD02-K,KH HUMHEM �{�f�B�[�o�b�O �� �u���b�N,4948377682596,5500,480,250,320,140,�{�f�B�[�o�b�O,�����S�ʎ��[,�I�t���̎���������,���a��,��G��̂悢�_�炩���Ɩ��Ղɋ������x�������˔��������a�Ȃ��̗p,�R�b�g���n�J�W���A����ƕ��Ƀ}�b�`���邷��f�ފ��ő�l�C,���y�ʂ�����,���[�͂ɗD�ꂽ�傫�߂̃{�f�B�[�o�b�O,�|�P�b�g�����ŏ������[�ɕ֗�,,,,,,,�u���b�N
HMBD02-N,KH HUMHEM �{�f�B�[�o�b�O �� �l�C�r�[,4948377682589,5500,480,250,320,140,�{�f�B�[�o�b�O,�����S�ʎ��[,�I�t���̎���������,���a��,��G��̂悢�_�炩���Ɩ��Ղɋ������x�������˔��������a�Ȃ��̗p,�R�b�g���n�J�W���A����ƕ��Ƀ}�b�`���邷��f�ފ��ő�l�C,���y�ʂ�����,���[�͂ɗD�ꂽ�傫�߂̃{�f�B�[�o�b�O,�|�P�b�g�����ŏ������[�ɕ֗�,,,,,,,�l�C�r�[
HMBTB01BR,KH HUMHEM �{�X�g���o�b�O �u���E��,4948377682633,6000,890,600,300,300,�{�X�g���o�b�O,�����E�C�E�w�����b�g�����[,�I�t���̎���������,���a��,��G��̂悢�_�炩���Ɩ��Ղɋ������x�������˔��������a�Ȃ��̗p,�R�b�g���n�J�W���A����ƕ��Ƀ}�b�`���邷��f�ފ��ő�l�C,���y�ʂ�����,�C�����̂܂܎��[�ł���O�t���|�P�b�g,���b�V���z���_�[�ŊȒP�������[,���[�����ʂɃ��b�V�����[�|�P�b�g�𕹐�,�莝���A�������A�����b�N�̂RWAY�g�p��,,,,,�u���E��
HMBTB01-K,KH HUMHEM �{�X�g���o�b�O �u���b�N,4948377682626,6000,890,600,300,300,�{�X�g���o�b�O,�����E�C�E�w�����b�g�����[,�I�t���̎���������,���a��,��G��̂悢�_�炩���Ɩ��Ղɋ������x�������˔��������a�Ȃ��̗p,�R�b�g���n�J�W���A����ƕ��Ƀ}�b�`���邷��f�ފ��ő�l�C,���y�ʂ�����,�C�����̂܂܎��[�ł���O�t���|�P�b�g,���b�V���z���_�[�ŊȒP�������[,���[�����ʂɃ��b�V�����[�|�P�b�g�𕹐�,�莝���A�������A�����b�N�̂RWAY�g�p��,,,,,�u���b�N
HMBTB01-N,KH HUMHEM �{�X�g���o�b�O �l�C�r�[,4948377682619,6000,890,600,300,300,�{�X�g���o�b�O,�����E�C�E�w�����b�g�����[,�I�t���̎���������,���a��,��G��̂悢�_�炩���Ɩ��Ղɋ������x�������˔��������a�Ȃ��̗p,�R�b�g���n�J�W���A����ƕ��Ƀ}�b�`���邷��f�ފ��ő�l�C,���y�ʂ�����,�C�����̂܂܎��[�ł���O�t���|�P�b�g,���b�V���z���_�[�ŊȒP�������[,���[�����ʂɃ��b�V�����[�|�P�b�g�𕹐�,�莝���A�������A�����b�N�̂RWAY�g�p��,,,,,�l�C�r�[
HMPST01BR,KH HUMHEM �V�����_�[�o�b�O �u���E��,4948377682664,7000,490,160,230,65,�V�����_�[�o�b�O,�����S�ʎ��[,�I�t���̎���������,���a��,��G��̂悢�_�炩���Ɩ��Ղɋ������x�������˔��������a�Ȃ��̗p,�R�b�g���n�J�W���A����ƕ��Ƀ}�b�`���邷��f�ފ��ő�l�C,���y�ʂ�����,�^�u���b�g���[�p�|�P�b�g�Ő����@�B�����S,�_�炩�V�����_�[�x���g�Ɍ��p�b�h�t���Ŕ��ɂ���,�}�O�l�b�g�����ߋ�Œ��g�̏o�����ꂪ�X�ɊȒP,,,,,,�u���E��
HMPST01-K,KH HUMHEM �V�����_�[�o�b�O �u���b�N,4948377682657,7000,490,160,230,65,�V�����_�[�o�b�O,�����S�ʎ��[,�I�t���̎���������,���a��,��G��̂悢�_�炩���Ɩ��Ղɋ������x�������˔��������a�Ȃ��̗p,�R�b�g���n�J�W���A����ƕ��Ƀ}�b�`���邷��f�ފ��ő�l�C,���y�ʂ�����,�^�u���b�g���[�p�|�P�b�g�Ő����@�B�����S,�_�炩�V�����_�[�x���g�Ɍ��p�b�h�t���Ŕ��ɂ���,�}�O�l�b�g�����ߋ�Œ��g�̏o�����ꂪ�X�ɊȒP,,,,,,�u���b�N
HMPST01-N,KH HUMHEM �V�����_�[�o�b�O �l�C�r�[,4948377682640,7000,490,160,230,65,�V�����_�[�o�b�O,�����S�ʎ��[,�I�t���̎���������,���a��,��G��̂悢�_�炩���Ɩ��Ղɋ������x�������˔��������a�Ȃ��̗p,�R�b�g���n�J�W���A����ƕ��Ƀ}�b�`���邷��f�ފ��ő�l�C,���y�ʂ�����,�^�u���b�g���[�p�|�P�b�g�Ő����@�B�����S,�_�炩�V�����_�[�x���g�Ɍ��p�b�h�t���Ŕ��ɂ���,�}�O�l�b�g�����ߋ�Œ��g�̏o�����ꂪ�X�ɊȒP,,,,,,�l�C�r�[
